Custom Query (2573 matches)

Filters
 
Or
 
  
 
Columns

Show under each result:


Results (901 - 1000 of 2573)

1 2 3 4 5 6 7 8 9 10 11 12 13 14 15 16 17 18 19 20
Ticket Summary Status Owner Milestone Component Ticket
#8737 Notepad++ and MinGW boost/asio ERROR new chris_kohlhoff To Be Determined asio
#8740 Possibly invalid assertion in define_with_defaults() new Ralf W. Grosse-Kunstleve To Be Determined python USE GITHUB
#8749 Accessing type of insert<map<>, pair<A,B> >::type discards inserted elements new Aleksey Gurtovoy To Be Determined mpl
#8762 Boost.Build engine build fails with MinGW toolset new To Be Determined Building Boost
#8766 is_iterator_category<Traversal> error new jeffrey.hellrung To Be Determined iterator
#8767 named_function_params.hpp: Unused variable warnings: (weight_map, tag_namespace) new Jeremiah Willcock To Be Determined graph
#8775 fusion transform and fold not respecting const-ness of the sequence new Joel de Guzman To Be Determined fusion
#8778 Building boost.log fails due to failure in date_time_format_parser new Hartmut Kaiser To Be Determined spirit
#8784 boost.asio.ssl.stream.set_verify_callback use custom verification callback, always succeed. new chris_kohlhoff To Be Determined asio
#8795 async_connect incorrectly reports success on failure reopened chris_kohlhoff To Be Determined asio
#8799 named condition notify_all does not wake up waiting process new Ion Gaztañaga To Be Determined interprocess
#8800 result_of.hpp:174: error: invalid use of incomplete type new No-Maintainer To Be Determined utility
#8803 Unused parameter issue new Daniel Wallin To Be Determined parameter
#8805 Getting error using Shell rule after upgrading to Ubuntu 12.04 new To Be Determined Building Boost
#8816 Android: error: fatal error: sys/statvfs.h: No such file or directory new Beman Dawes To Be Determined filesystem
#8818 Python compilation errors with mingw w64/gcc4.8.1 new Ralf W. Grosse-Kunstleve To Be Determined python USE GITHUB
#8820 Reduce debug symbols size new Joel de Guzman To Be Determined spirit
#8821 bootstrap build.bat fails for vc11 toolset new To Be Determined Building Boost
#8822 issues compiling regex on SunOS 5.9 sparc new Daniel James To Be Determined hash
#8828 bug in boost_asio/example/cpp03/http/server3/server.cpp new chris_kohlhoff Boost 1.55.0 asio
#8830 fix spelling of "polynomial" in crc library and documentation new Daryle Walker To Be Determined crc
#8835 failed to use boost::asio::steady_timer w/ clang 3.3 new chris_kohlhoff To Be Determined asio
#8836 boost::property_tree and BOM new Sebastian Redl To Be Determined property_tree
#8841 Duplicated rules for mpi.so with MPI support when building both single and multi-threaded flavors new Matthias Troyer To Be Determined mpi
#8853 [tuple] GCC 4.8+ warns unused local typedef... new Joel de Guzman To Be Determined tuple
#8856 [date_time] GCC 4.8+ warns unused local typedef... new az_sw_dude To Be Determined date_time
#8857 Compile error in boost range when trying to use boost string split new Marshall Clow To Be Determined algorithm
#8861 boost 1.39 io_service_pool accept hangs new chris_kohlhoff To Be Determined asio
#8863 BOOST_ATTRIBUTE_NORETURN causes stack pointer corruption new Emil Dotchevski To Be Determined exception
#8865 comparison of unsigned expression warning new Sebastian Redl To Be Determined property_tree
#8870 [spirit] GCC 4.8+ warns about unused local typedef new Joel de Guzman To Be Determined spirit
#8871 [numeric] GCC 4.8+ warns about unused local typedef new Douglas Gregor To Be Determined numeric
#8884 boost asio in posix_event: lock release before condition signaled new chris_kohlhoff To Be Determined asio
#8885 boost asio epoll reactor method "set_ready_events" not protected by lock new chris_kohlhoff To Be Determined asio
#8886 boost::posix_time::time_from_string has no parameter for ymd order new az_sw_dude To Be Determined date_time
#8888 [python] GCC 4.8+ warns about unused local typedef new Ralf W. Grosse-Kunstleve To Be Determined python USE GITHUB
#8889 Boost.Build MSVC fix building PDBs new Vladimir Prus To Be Determined build
#8896 image_view compile error under clang 3.1 new Stefan Seefeld To Be Determined gil USE GITHUB
#8913 boost/asio/detail/posix_static_mutex.hpp: Ignores all failures from pthread_* functions new chris_kohlhoff To Be Determined asio
#8918 boost/asio/detail/impl/win_iocp_io_service.ipp: Ignores failures from WaitForSingleObject new chris_kohlhoff To Be Determined asio
#8919 boost/asio/detail/impl/win_static_mutex.ipp: Ignores failures from WaitForSingleObject new chris_kohlhoff To Be Determined asio
#8920 boost/asio/detail/impl/win_thread.ipp: Ignores failures from WaitForSingleObject and WaitForMultipleObjects new chris_kohlhoff To Be Determined asio
#8921 boost/asio/detail/win_event.hpp: Ignores failures from WaitForSingleObject new chris_kohlhoff To Be Determined asio
#8922 boost/asio/detail/wince_thread.hpp: Ignores failures from WaitForSingleObject new chris_kohlhoff To Be Determined asio
#8923 boost/detail/lightweight_thread.hpp: Ignores failures from WaitForSingleObject new Peter Dimov To Be Determined smart_ptr
#8926 Windows error messages used for errno codes new Beman Dawes To Be Determined system
#8928 Build failed boost 1.54 on Mac with zlib source (-sZLIB_SOURCE) with clang and c++11 new To Be Determined Building Boost
#8934 b2 : failed to write output file new Vladimir Prus To Be Determined build
#8936 month_iterator snaps-to-end when starting on the last day of a 30 day month new az_sw_dude To Be Determined date_time
#8937 boost::asio::ip::tcp 5000ms stall new chris_kohlhoff To Be Determined asio
#8939 boot filesystem error when copy-overwrite-the file to itself new Beman Dawes To Be Determined filesystem
#8946 filesystem::directory_iterator returns incorrect listing new Beman Dawes To Be Determined filesystem
#8948 iostreams::filtering_stream<outout>::sync does not exist new Jonathan Turkanis To Be Determined iostreams
#8949 Spirit VC10 compilation error : boost\spirit\repository\home\qi\operator\keywords.hpp(169): error C2653: 'mpl_' : is not a class or namespace name new Joel de Guzman To Be Determined spirit
#8951 Duplicate name of actual target: <pstage-gcc\lib>libboost_exception-mgw47-d-1_54.a new To Be Determined Building Boost
#8952 numeric::interval::nth_root generates empty interval new Boris Gubenko To Be Determined interval
#8954 clang static analyser undefined value in boost/libs/filesystem/src/unique_path.cpp new Beman Dawes Boost 1.55.0 filesystem
#8962 adjacency_list doesn't work with hash_setS new Jeremiah Willcock To Be Determined graph
#8971 -Wunused-local-typedefs warnings with GCC 4.8.1 new Ronald Garcia To Be Determined multi_array
#8975 Throw exception on allocation failure in cpp_regex_traits::value new Eric Niebler To Be Determined xpressive
#8978 Segfault crash in boost.python with keyword arguments and overloads. new Ralf W. Grosse-Kunstleve To Be Determined python USE GITHUB
#8982 More -Wunused-local-typedef warnings when building Boost 1.54.0 with gcc 4.8.1 new Eric Niebler To Be Determined xpressive
#8984 More -Wunused-local-typedef warnings when building Boost 1.54.0 with gcc 4.8.1 new Joel de Guzman To Be Determined spirit
#8985 More -Wunused-local-typedef warnings when building Boost 1.54.0 with gcc 4.8.1 new Ralf W. Grosse-Kunstleve To Be Determined python USE GITHUB
#8991 A few implicit conversion compiler warnings new Antony Polukhin To Be Determined lexical_cast
#9002 boots::date_time::from_iso_string() accepts invalid time mark new az_sw_dude To Be Determined date_time
#9004 Minor corrections for boost.program_options documentation new Vladimir Prus To Be Determined program_options
#9006 read_xml segfaults if run from boost::asio::spawn new Sebastian Redl To Be Determined property_tree
#9017 Support for std::numeric_traits new Daryle Walker To Be Determined rational
#9018 No cross-version constructor new Daryle Walker To Be Determined rational
#9020 kth_channel_view fails when used with virtual views new Stefan Seefeld To Be Determined gil USE GITHUB
#9021 Cannot export boost::iostreams::source implementation on MSVC new Jonathan Turkanis To Be Determined iostreams
#9022 regression_file_iterator* test fails with c++11 new Joel de Guzman To Be Determined spirit
#9032 Wrong Boost.Iterator permutation_iterator::base() description new jeffrey.hellrung To Be Determined iterator
#9033 Resource Leak in boost::filesystem in operation.cpp at resize_file_api() (Windows) new Beman Dawes To Be Determined filesystem
#9034 Timezone (%Q) is ignored in time_input_facet / local_time_input_facet new az_sw_dude To Be Determined date_time
#9038 [pool] Test cases need to link with boost_system DSO on Linux new Chris Newbold To Be Determined pool
#9039 Boost.Bimap documentation misprint new Matias Capeletto To Be Determined bimap
#9043 Boost serialization version does not work on Windows reopened Robert Ramey To Be Determined serialization
#9044 Enable constexpr for applicable operators. new Daniel Frey To Be Determined operators
#9051 jam build system refuses to work on windows, won't build on mingw-w64 new To Be Determined Building Boost
#9055 spin_condition.notify()hangs if communication peer crashes new Ion Gaztañaga To Be Determined interprocess
#9056 empty_ptree missing from boost new Sebastian Redl To Be Determined property_tree
#9059 Boost.Asio detail/impl/win_static_mutex leaks a CRITICAL_SECTION reopened chris_kohlhoff To Be Determined asio
#9066 Add support for MultiPoint WKB format new Mateusz Loskot To Be Determined geometry
#9067 rational::assign doesn't even have the basic guarantee new Daryle Walker To Be Determined rational
#9075 Devision by zero in boost/date_time/int_adapter.hpp new az_sw_dude To Be Determined date_time
#9081 boost geometry booleans create self-intersecting polygons from non-self-intersecting polygons reopened Barend Gehrels Boost 1.56.0 geometry
#9084 boost::asio::ip::address::is_loopback() on mapped ip4 127.0.0.1 new chris_kohlhoff To Be Determined asio
#9088 I/O Exception state & status savers may cause std::terminate in C++11 new Daryle Walker To Be Determined io
#9089 missing locale in strings_from_facet.hpp new az_sw_dude To Be Determined date_time
#9097 directory_iterator crash with intel release builds on windows new Beman Dawes To Be Determined filesystem
#9099 boost::filesystem::stem() reporting wrong value on some entries (seen on Linux) new Beman Dawes To Be Determined filesystem
#9102 Various Boost header files define variables with internal linkage, which results in unnecessary code bloat new Beman Dawes To Be Determined system
#9105 boost::tokenizer fails if string contains percent signs new jsiek To Be Determined tokenizer
#9112 [tr1] Failures in test_ref_wrapper_tricky.cpp new Peter Dimov To Be Determined result_of
#9114 Documentation examples not working new Joel de Guzman To Be Determined spirit
#9116 Binary serialization: bitwise copying should also apply to single POD objects (it now only seems to work on arrays/collections) new Robert Ramey To Be Determined serialization
#9118 Seg fault on thread join when llvm and libc++ are used reopened viboes To Be Determined thread
#9119 memory errors and eventual segfault when using Log new Beman Dawes To Be Determined filesystem
1 2 3 4 5 6 7 8 9 10 11 12 13 14 15 16 17 18 19 20
Note: See TracQuery for help on using queries.